BDBM50262020 4-(6-phenylpyrazolo[1,5-a]pyrimidin-3-yl)quinoline::CHEMBL469055
SMILES c1nn2cc(cnc2c1-c1ccnc2ccccc12)-c1ccccc1
InChI Key InChIKey=QBSQJJUIEKBBLE-UHFFFAOYSA-N
Data  1 IC50
  Tab Delimited (TSV)   2D SDfile   Computed 3D by Vconf -m prep SDfile
Find this compound or compounds like it in BindingDB:
Activity Spreadsheet -- Enzyme Inhibition Constant Data from BindingDB
Found 1 hit for monomerid = 50262020
TargetBone morphogenetic protein 4(Homo sapiens (Human))
Harvard Medical School
Curated by ChEMBL
LigandPNGBDBM50262020(4-(6-phenylpyrazolo[1,5-a]pyrimidin-3-yl)quinoline...)
Affinity DataIC50:  750nM. Assay description: Inhibition of BMP4 (unknown origin)-induced phosphorylation of SMAD 1/5/8 by cytoblot cellular ELISA
In DepthDetails ArticlePubMed