BDBM50262045 CHEMBL4087724
SMILES Cc1ccc(cc1)[C@@H]1CN(C[C@H]1c1ccc(cc1)C#N)C(=O)CC1CCCNC1
InChI Key InChIKey=SEICDUUIVWDVDG-BMTNDILFSA-N
Data  1 IC50  1 Kd
  Tab Delimited (TSV)   2D SDfile   Computed 3D by Vconf -m prep SDfile
Find this compound or compounds like it in BindingDB:
Activity Spreadsheet -- Enzyme Inhibition Constant Data from BindingDB
Found 2 hits for monomerid = 50262045
TargetLysine-specific histone demethylase 1A(Homo sapiens (Human))
University Of Manchester
Curated by ChEMBL
LigandPNGBDBM50262045(CHEMBL4087724)
Affinity DataKd:  110nM. Assay description: Inhibition of recombinant human N-terminal truncated LSD1 (151 to 852 residues) expressed in Escherichia coli using histone H3(1-21)K4(Me1) biotin pe...
In DepthDetails ArticlePubMed
TargetLysine-specific histone demethylase 1A(Homo sapiens (Human))
University Of Manchester
Curated by ChEMBL
LigandPNGBDBM50262045(CHEMBL4087724)
Affinity DataIC50:  570nM. Assay description: Inhibition of recombinant human N-terminal truncated LSD1 (151 to 852 residues) expressed in Escherichia coli using histone H3(1-21)K4(Me1) biotin pe...
In DepthDetails ArticlePubMed