BDBM50262099 CHEMBL4074121
SMILES CC(C)C[C@H](NC(=O)[C@H](Cc1ccc2ccccc2c1)NC(=O)[C@H](Cc1ccc(O)cc1)NC(=O)CN1CCNCC1)C(=O)N[C@@H](Cc1ccccc1)C(=O)N[C@@H](CCCNC(N)=N)C(=O)N1CCC[C@H]1C(=O)N[C@@H](CCCNC(N)=N)C(=O)N[C@@H](CC(N)=O)C(O)=O
InChI Key InChIKey=FGYQREJLQGOMTG-XKIFMCPMSA-N
Data  4 EC50
  Tab Delimited (TSV)   2D SDfile   Computed 3D by Vconf -m prep SDfile
Find this compound or compounds like it in BindingDB:
Activity Spreadsheet -- Enzyme Inhibition Constant Data from BindingDB
Found 4 hits for monomerid = 50262099
TargetNeuromedin-U receptor 1(Homo sapiens (Human))
Takeda Pharmaceutical
Curated by ChEMBL
LigandPNGBDBM50262099(CHEMBL4074121)
Affinity DataEC50:  9.5nM. Assay description: Agonist activity at human NMUR1 expressed in CHO cells assessed as increase in intracellular calcium influx after 180 secs by Fluo 4-AM dye based FLI...
In DepthDetails ArticlePubMed
TargetNeuromedin-U receptor 1(Mus musculus)
Takeda Pharmaceutical
Curated by ChEMBL
LigandPNGBDBM50262099(CHEMBL4074121)
Affinity DataEC50:  9.60nM. Assay description: Agonist activity at mouse NMUR1 expressed in CHO cells assessed as increase in intracellular calcium influx after 180 secs by Fluo 4-AM dye based FLI...
In DepthDetails ArticlePubMed
TargetNeuromedin-U receptor 2(Mus musculus)
Takeda Pharmaceutical
Curated by ChEMBL
LigandPNGBDBM50262099(CHEMBL4074121)
Affinity DataEC50:  0.110nM. Assay description: Agonist activity at mouse NMUR2 expressed in CHO cells assessed as increase in intracellular calcium influx after 180 secs by Fluo 4-AM dye based FLI...
In DepthDetails ArticlePubMed
TargetNeuromedin-U receptor 2(Homo sapiens (Human))
Takeda Pharmaceutical
Curated by ChEMBL
LigandPNGBDBM50262099(CHEMBL4074121)
Affinity DataEC50:  0.200nM. Assay description: Agonist activity at human NMUR2 expressed in CHO cells assessed as increase in intracellular calcium influx after 180 secs by Fluo 4-AM dye based FLI...
In DepthDetails ArticlePubMed