BDBM50262190 2,3-dibromo-1-(4-(hydroxy(oxido)amino)phenyl)-3-(4-quinolinyl)-1-propanone::CHEMBL469203::NSC-150289
SMILES [O-][N+](=O)c1ccc(cc1)C(=O)C(Br)C(Br)c1ccnc2ccccc12
InChI Key InChIKey=OVEVOPGYRGCOMR-UHFFFAOYSA-N
Data  1 IC50
  Tab Delimited (TSV)   2D SDfile   Computed 3D by Vconf -m prep SDfile
Find this compound or compounds like it in BindingDB:
Activity Spreadsheet -- Enzyme Inhibition Constant Data from BindingDB
Found 1 hit for monomerid = 50262190
TargetAdenylate cyclase(Spirulina platensis)
Ruhr-University Bochum
Curated by ChEMBL
LigandPNGBDBM50262190(2,3-dibromo-1-(4-(hydroxy(oxido)amino)phenyl)-3-(4...)
Affinity DataIC50:  1.00E+5nM. Assay description: Inhibition of Spirulina platensis adenylyl cyclase assessed as cAMP level by cAMP immunogenic assay
In DepthDetails ArticlePubMed