BDBM50262588 6-Methyl-biphenyl-3,4'-dicarboxylic acid 4'-[(3-cyano-phenyl)-amide] 3-[(4-methoxy-phenyl)-amide]::CHEMBL476111
SMILES COc1ccc(NC(=O)c2ccc(C)c(c2)-c2ccc(cc2)C(=O)Nc2cccc(c2)C#N)cc1
InChI Key InChIKey=RYQOURLRCRLGMF-UHFFFAOYSA-N
Data  1 KI
  Tab Delimited (TSV)   2D SDfile   Computed 3D by Vconf -m prep SDfile
Find this compound or compounds like it in BindingDB:
Activity Spreadsheet -- Enzyme Inhibition Constant Data from BindingDB
Found 1 hit for monomerid = 50262588
TargetMitogen-activated protein kinase 14(Human)
Glaxosmithkline
Curated by ChEMBL
LigandPNGBDBM50262588(6-Methyl-biphenyl-3,4'-dicarboxylic acid 4'-[(3-cy...)
Affinity DataKi:  730nM. Assay description: Displacement of rhodamine-green labeled (2-(6-amino-3-imino-3H-xanthen-9-yl)-5-{[({4-[4-(4-Cl-3-hydroxyphenyl)-5-(4-pyridinyl)-1H-imidazol-2yl]phenyl...
In DepthDetails ArticlePubMed