BDBM50262799 2-(2,6-dichlorophenyl)ethylamine::CHEMBL510649
SMILES NCCc1c(Cl)cccc1Cl
InChI Key InChIKey=ACIMQXSSGMWVKG-UHFFFAOYSA-N
Data  1 EC50
  Tab Delimited (TSV)   2D SDfile   Computed 3D by Vconf -m prep SDfile
Find this compound or compounds like it in BindingDB:
Activity Spreadsheet -- Enzyme Inhibition Constant Data from BindingDB
Found 1 hit for monomerid = 50262799
TargetTrace amine-associated receptor 1(Homo sapiens (Human))
Rti International
Curated by ChEMBL
LigandPNGBDBM50262799(2-(2,6-dichlorophenyl)ethylamine | CHEMBL510649)
Affinity DataEC50:  51nM. Assay description: Agonist activity at human trace amine associated receptor 1 expressed in RD-HGA16 CHO-K1 cells coexpressed with Galpha16 protein assessed as internal...
In DepthDetails ArticlePubMed