BDBM50262878 3-hydroxy-5-(3-(3-hydroxy-5-(trimethylammonio)phenoxy)propoxy)-N,N,N-trimethylbenzenaminium iodide::CHEMBL477140
SMILES C[N+](C)(C)c1cc(O)cc(OCCCOc2cc(O)cc(c2)[N+](C)(C)C)c1
InChI Key InChIKey=KYKAASBPZQEFMK-UHFFFAOYSA-P
Data  2 IC50
  Tab Delimited (TSV)   2D SDfile   Computed 3D by Vconf -m prep SDfile
Find this compound or compounds like it in BindingDB:
Activity Spreadsheet -- Enzyme Inhibition Constant Data from BindingDB
Found 2 hits for monomerid = 50262878
TargetCholinesterase(Equus caballus (Horse))
Università
Curated by ChEMBL
LigandPNGBDBM50262878(3-hydroxy-5-(3-(3-hydroxy-5-(trimethylammonio)phen...)
Affinity DataIC50:  718nM. Assay description: Inhibition of equine BChE by Ellman's method
In DepthDetails ArticlePubMed
TargetAcetylcholinesterase(Bos taurus (bovine))
Università
Curated by ChEMBL
LigandPNGBDBM50262878(3-hydroxy-5-(3-(3-hydroxy-5-(trimethylammonio)phen...)
Affinity DataIC50:  0.490nM. Assay description: Inhibition of bovine AChE by Ellman's method
In DepthDetails ArticlePubMed