BDBM50263144 9-(2,6-difluorobenzyl)-2-butoxy-N-methyl-9H-purin-6-amine::CHEMBL515476
SMILES CCCCOc1nc(NC)c2ncn(Cc3c(F)cccc3F)c2n1
InChI Key InChIKey=KDPDVHGYVJHYIB-UHFFFAOYSA-N
Data  1 IC50
  Tab Delimited (TSV)   2D SDfile   Computed 3D by Vconf -m prep SDfile
Find this compound or compounds like it in BindingDB:
Activity Spreadsheet -- Enzyme Inhibition Constant Data from BindingDB
Found 1 hit for monomerid = 50263144
TargetGlutamate racemase(Enterococcus faecalis)
Astrazeneca R&D Boston
Curated by ChEMBL
LigandPNGBDBM50263144(9-(2,6-difluorobenzyl)-2-butoxy-N-methyl-9H-purin-...)
Affinity DataIC50:  5.50E+3nM. Assay description: Inhibition of Enterococcus faecalis MurI
In DepthDetails ArticlePubMed