BDBM50263282 CHEMBL4073354
SMILES COc1cccc(c1)-c1nc(Nc2ccc(OC)c(OC)c2)c2cccnc2n1
InChI Key InChIKey=PSEVAJQEEUSDQJ-UHFFFAOYSA-N
Data  1 IC50  1 EC50
  Tab Delimited (TSV)   2D SDfile   Computed 3D by Vconf -m prep SDfile
Find this compound or compounds like it in BindingDB:
Activity Spreadsheet -- Enzyme Inhibition Constant Data from BindingDB
Found 2 hits for monomerid = 50263282
TargetBroad substrate specificity ATP-binding cassette transporter ABCG2(Homo sapiens (Human))
University Of Bonn
Curated by ChEMBL
LigandPNGBDBM50263282(CHEMBL4073354)
Affinity DataIC50:  572nM. Assay description: Activation of recombinant human ABCG2 ATPase activity expressed in baculovirus infected High five insect cell membranes after 20 mins by ascorbic aci...
In DepthDetails ArticlePubMed
TargetBroad substrate specificity ATP-binding cassette transporter ABCG2(Homo sapiens (Human))
University Of Bonn
Curated by ChEMBL
LigandPNGBDBM50263282(CHEMBL4073354)
Affinity DataEC50:  13nM. Assay description: Activation of recombinant human ABCG2 ATPase activity expressed in baculovirus infected High five insect cell membranes after 20 mins by ascorbic aci...
In DepthDetails ArticlePubMed