BDBM50263692 CHEMBL4105125
SMILES CCC(=O)NC1CN(Cc2ccccc2)c2ccccc2C1
InChI Key InChIKey=XBYYWVDFTINCIN-UHFFFAOYSA-N
Data  2 KI  1 EC50
  Tab Delimited (TSV)   2D SDfile   Computed 3D by Vconf -m prep SDfile
Find this compound or compounds like it in BindingDB:
Activity Spreadsheet -- Enzyme Inhibition Constant Data from BindingDB
Found 3 hits for monomerid = 50263692
TargetMelatonin receptor type 1B(Homo sapiens (Human))
Universit£
Curated by ChEMBL
LigandPNGBDBM50263692(CHEMBL4105125)
Affinity DataKi:  6nM. Assay description: Inhibition of human CatL using Cbz-Phe-Arg-AMC as substrate measured over 30 mins by fluorimetric method
In DepthDetails ArticlePubMed
TargetMelatonin receptor type 1A(Homo sapiens (Human))
Universit£
Curated by ChEMBL
LigandPNGBDBM50263692(CHEMBL4105125)
Affinity DataKi:  892nM. Assay description: Displacement of 2-[125I]-Iodomelatonin from human MT1 receptor expressed in CHO cell membranes after 120 mins by filter binding method
In DepthDetails ArticlePubMed
TargetMelatonin receptor type 1B(Homo sapiens (Human))
Universit£
Curated by ChEMBL
LigandPNGBDBM50263692(CHEMBL4105125)
Affinity DataEC50: >1.00E+4nM. Assay description: Intrinsic activity at human MT2 receptor expressed in CHO cell membranes after 1 hr by [35S]GTPgammaS binding assay
In DepthDetails ArticlePubMed