BDBM50263752 CHEMBL4092829
SMILES Cc1n[nH]c(c1-c1nc(C(F)F)c2n1nc(C)[nH]c2=O)-c1ccc(cc1)C(F)(F)F
InChI Key InChIKey=KTTOSMPSKFXDGC-UHFFFAOYSA-N
Data  1 IC50
  Tab Delimited (TSV)   2D SDfile   Computed 3D by Vconf -m prep SDfile
Find this compound or compounds like it in BindingDB:
Activity Spreadsheet -- Enzyme Inhibition Constant Data from BindingDB
Found 1 hit for monomerid = 50263752
TargetcGMP-dependent 3',5'-cyclic phosphodiesterase(Homo sapiens (Human))
Pfizer
Curated by ChEMBL
LigandPNGBDBM50263752(CHEMBL4092829)
Affinity DataIC50:  0.230nM. Assay description: Inhibition of human PDE2A1 using 3',5'-[3H]cGMP as substrate after 30 mins by scintillation proximity assay
In DepthDetails ArticlePubMed