BDBM50264143 CHEMBL491199::N-{(3-exo)-8-[(6-Fluoro-2-naphthyl)methyl]-8-azabicyclo[3.2.1]oct-3-yl}-2-pyridin-4-ylbenzamide
SMILES Fc1ccc2cc(CN3[C@@H]4CC[C@@H]3CC(C4)NC(=O)c3ccccc3-c3ccncc3)ccc2c1
InChI Key InChIKey=ORBGIALYWQHFBH-KAYWLYCHSA-N
Data  1 IC50
  Tab Delimited (TSV)   2D SDfile   Computed 3D by Vconf -m prep SDfile
Find this compound or compounds like it in BindingDB:
Activity Spreadsheet -- Enzyme Inhibition Constant Data from BindingDB
Found 1 hit for monomerid = 50264143
TargetC-C chemokine receptor type 3(Homo sapiens (Human))
Astellas Pharma
Curated by ChEMBL
LigandPNGBDBM50264143(CHEMBL491199 | N-{(3-exo)-8-[(6-Fluoro-2-naphthyl)...)
Affinity DataIC50:  613nM. Assay description: Antagonist activity at CCR3 receptor expressed in mouse B300-19 cells assessed as inhibition of eotaxin-induced calcium influx by spectrophotometry
In DepthDetails ArticlePubMed