BDBM50264164 5-[2-Chloro-6-(3-iodo-benzylamino)-purin-9-yl]-3,4-dihydroxy-tetrahydro-furan-2-carboxylic acid methoxy-amide::CHEMBL491416
SMILES CONC(=O)[C@H]1O[C@H]([C@H](O)[C@@H]1O)n1cnc2c(NCc3cccc(I)c3)nc(Cl)nc12
InChI Key InChIKey=XBEYTDKCEMOOOY-PFHKOEEOSA-N
Data  3 KI
  Tab Delimited (TSV)   2D SDfile   Computed 3D by Vconf -m prep SDfile
Find this compound or compounds like it in BindingDB:
Activity Spreadsheet -- Enzyme Inhibition Constant Data from BindingDB
Found 3 hits for monomerid = 50264164
TargetAdenosine receptor A3(Homo sapiens (Human))
National Institute Of Diabetes And Digestive And Kidney Diseases
Curated by ChEMBL
LigandPNGBDBM50264164(5-[2-Chloro-6-(3-iodo-benzylamino)-purin-9-yl]-3,4...)
Affinity DataKi:  86.2nM. Assay description: Displacement of [3H]CGS21680 form human adenosine A3 receptor expressed in CHO cells
In DepthDetails ArticlePubMed
TargetAdenosine receptor A1(Homo sapiens (Human))
National Institute Of Diabetes And Digestive And Kidney Diseases
Curated by ChEMBL
LigandPNGBDBM50264164(5-[2-Chloro-6-(3-iodo-benzylamino)-purin-9-yl]-3,4...)
Affinity DataKi:  870nM. Assay description: Displacement of [3H]CCPA form human adenosine A1 receptor expressed in CHO cells
In DepthDetails ArticlePubMed
TargetAdenosine receptor A2a(Homo sapiens (Human))
National Institute Of Diabetes And Digestive And Kidney Diseases
Curated by ChEMBL
LigandPNGBDBM50264164(5-[2-Chloro-6-(3-iodo-benzylamino)-purin-9-yl]-3,4...)
Affinity DataKi:  1.67E+3nM. Assay description: Displacement of [3H]R-PIA form human adenosine A2A receptor expressed in HEK cells
In DepthDetails ArticlePubMed