BDBM50264344 CHEMBL4082652
SMILES CCCCCCCCCC(=O)C1C(=O)C(C)(C)C(=O)C(C)(C)C1=O
InChI Key InChIKey=UKYHLLGYGAUXBA-UHFFFAOYSA-N
Data  1 IC50
  Tab Delimited (TSV)   2D SDfile   Computed 3D by Vconf -m prep SDfile
Find this compound or compounds like it in BindingDB:
Activity Spreadsheet -- Enzyme Inhibition Constant Data from BindingDB
Found 1 hit for monomerid = 50264344
Target4-hydroxyphenylpyruvate dioxygenase(Arabidopsis thaliana)
Universit£
Curated by ChEMBL
LigandPNGBDBM50264344(CHEMBL4082652)
Affinity DataIC50:  19nM. Assay description: Inhibition of Arabidopsis thaliana HPPD expressed in Escherichia coli JM105 using 4-HPP as substrate preincubated for 15 mins followed by substrate a...
In DepthDetails ArticlePubMed