BDBM50264400 1-benzyl-N-isopropyl-N-(2-(4-(1-methylpiperidin-4-yl)piperazin-1-yl)-2-oxoethyl)-1H-benzo[d]imidazole-2-carboxamide::CHEMBL492048
SMILES CC(C)N(CC(=O)N1CCN(CC1)C1CCN(C)CC1)C(=O)c1nc2ccccc2n1Cc1ccccc1
InChI Key InChIKey=OPQMHLKQNNIKBF-UHFFFAOYSA-N
Data  1 IC50
  Tab Delimited (TSV)   2D SDfile   Computed 3D by Vconf -m prep SDfile
Find this compound or compounds like it in BindingDB:
Activity Spreadsheet -- Enzyme Inhibition Constant Data from BindingDB
Found 1 hit for monomerid = 50264400
TargetB1 bradykinin receptor(Macaca fascicularis)
Neurogen
Curated by ChEMBL
LigandPNGBDBM50264400(1-benzyl-N-isopropyl-N-(2-(4-(1-methylpiperidin-4-...)
Affinity DataIC50:  465nM. Assay description: Antagonist activity at Cynomolgus monkey bradykinin B1 receptor expressed in CHO cells assessed as calcium transient by FLIPR assay
In DepthDetails ArticlePubMed