BDBM50264493 CHEMBL489608::trans-4-[5-(5-Trifluoromethyl-[1,2,4]oxadiazol-3-yl)-1H-benzoimidazol-2-yl]-spiro[cyclohexane-1,1'-isobenzofuran]-3'-one
SMILES FC(F)(F)c1nc(no1)-c1ccc2[nH]c(nc2c1)[C@H]1CC[C@@]2(CC1)OC(=O)c1ccccc21
InChI Key InChIKey=FHCADCMGOCLSAT-ZCNVGUKTSA-N
Data  1 IC50
  Tab Delimited (TSV)   2D SDfile   Computed 3D by Vconf -m prep SDfile
Find this compound or compounds like it in BindingDB:
Activity Spreadsheet -- Enzyme Inhibition Constant Data from BindingDB
Found 1 hit for monomerid = 50264493
TargetNeuropeptide Y receptor type 5(Homo sapiens (Human))
Banyu Tsukuba Research Institute
Curated by ChEMBL
LigandPNGBDBM50264493(CHEMBL489608 | trans-4-[5-(5-Trifluoromethyl-[1,2,...)
Affinity DataIC50:  2.10nM. Assay description: Displacement of [125I]PYY from human recombinant NPYY5 receptor expressed in mouse LMtk cells
In DepthDetails ArticlePubMed