BDBM50264632 CHEMBL489810::N-(2-((4-(piperidin-1-ylmethyl)benzyl)(methyl)amino)-2-oxoethyl)-1-benzyl-1H-benzo[d]imidazole-2-carboxamide
SMILES CN(Cc1ccc(CN2CCCCC2)cc1)C(=O)CNC(=O)c1nc2ccccc2n1Cc1ccccc1
InChI Key InChIKey=RPJDNSHQYKDQRX-UHFFFAOYSA-N
Data  1 IC50
  Tab Delimited (TSV)   2D SDfile   Computed 3D by Vconf -m prep SDfile
Find this compound or compounds like it in BindingDB:
Activity Spreadsheet -- Enzyme Inhibition Constant Data from BindingDB
Found 1 hit for monomerid = 50264632
TargetB1 bradykinin receptor(Macaca fascicularis)
Neurogen
Curated by ChEMBL
LigandPNGBDBM50264632(CHEMBL489810 | N-(2-((4-(piperidin-1-ylmethyl)benz...)
Affinity DataIC50:  196nM. Assay description: Antagonist activity at Cynomolgus monkey bradykinin B1 receptor expressed in CHO cells assessed as calcium transient by FLIPR assay
In DepthDetails ArticlePubMed