BDBM50264981 (4-(6-chloro-5-(trifluoromethyl)pyridin-2-yl)piperazin-1-yl)(2-morpholino-5-nitrophenyl)methanone::CHEMBL498380
SMILES [O-][N+](=O)c1ccc(N2CCOCC2)c(c1)C(=O)N1CCN(CC1)c1ccc(c(Cl)n1)C(F)(F)F
InChI Key InChIKey=YAYKUINUDPHATJ-UHFFFAOYSA-N
Data  2 EC50
  Tab Delimited (TSV)   2D SDfile   Computed 3D by Vconf -m prep SDfile
Find this compound or compounds like it in BindingDB:
Activity Spreadsheet -- Enzyme Inhibition Constant Data from BindingDB
Found 2 hits for monomerid = 50264981
TargetSodium- and chloride-dependent glycine transporter 2(Homo sapiens (Human))
F. Hoffmann-La Roche
Curated by ChEMBL
LigandPNGBDBM50264981((4-(6-chloro-5-(trifluoromethyl)pyridin-2-yl)piper...)
Affinity DataEC50:  2.40E+4nM. Assay description: Inhibition of [3H]glycine uptake at human glycine transporter 2 expressed in CHO cells by scintillation counter
In DepthDetails ArticlePubMed
TargetSodium- and chloride-dependent glycine transporter 1(Homo sapiens (Human))
F. Hoffmann-La Roche
Curated by ChEMBL
LigandPNGBDBM50264981((4-(6-chloro-5-(trifluoromethyl)pyridin-2-yl)piper...)
Affinity DataEC50:  33nM. Assay description: Inhibition of [3H]glycine uptake at human glycine transporter 1 expressed in CHO cells by scintillation counter
In DepthDetails ArticlePubMed