BDBM50265096 1-(3-fluoro-4-(4-(2-morpholino-5-nitrobenzoyl)piperazin-1-yl)phenyl)ethanone::CHEMBL526280
SMILES CC(=O)c1ccc(N2CCN(CC2)C(=O)c2cc(ccc2N2CCOCC2)[N+]([O-])=O)c(F)c1
InChI Key InChIKey=NEFFMZJKQNSKMQ-UHFFFAOYSA-N
Data  2 EC50
  Tab Delimited (TSV)   2D SDfile   Computed 3D by Vconf -m prep SDfile
Find this compound or compounds like it in BindingDB:
Activity Spreadsheet -- Enzyme Inhibition Constant Data from BindingDB
Found 2 hits for monomerid = 50265096
TargetSodium- and chloride-dependent glycine transporter 1(Homo sapiens (Human))
F. Hoffmann-La Roche
Curated by ChEMBL
LigandPNGBDBM50265096(1-(3-fluoro-4-(4-(2-morpholino-5-nitrobenzoyl)pipe...)
Affinity DataEC50:  15nM. Assay description: Inhibition of [3H]glycine uptake at human glycine transporter 1 expressed in CHO cells by scintillation counter
In DepthDetails ArticlePubMed
TargetSodium- and chloride-dependent glycine transporter 2(Homo sapiens (Human))
F. Hoffmann-La Roche
Curated by ChEMBL
LigandPNGBDBM50265096(1-(3-fluoro-4-(4-(2-morpholino-5-nitrobenzoyl)pipe...)
Affinity DataEC50:  4.80E+3nM. Assay description: Inhibition of [3H]glycine uptake at human glycine transporter 2 expressed in CHO cells by scintillation counter
In DepthDetails ArticlePubMed