BDBM50265197 CHEMBL497987::N-cyclopropyl-4-methyl-3-(1-oxo-1,2-dihydroisoquinolin-7-yl)benzamide
SMILES Cc1ccc(cc1-c1ccc2cc[nH]c(=O)c2c1)C(=O)NC1CC1
InChI Key InChIKey=JZPJXHAIVRFFPE-UHFFFAOYSA-N
Data  1 KI
  Tab Delimited (TSV)   2D SDfile   Computed 3D by Vconf -m prep SDfile
Find this compound or compounds like it in BindingDB:
Activity Spreadsheet -- Enzyme Inhibition Constant Data from BindingDB
Found 1 hit for monomerid = 50265197
TargetMitogen-activated protein kinase 14(Homo sapiens (Human))
Glaxosmithkline
Curated by ChEMBL
LigandPNGBDBM50265197(CHEMBL497987 | N-cyclopropyl-4-methyl-3-(1-oxo-1,2...)
Affinity DataKi:  420nM. Assay description: Displacement of fluorescent ATP competitive ligand from p38alpha
In DepthDetails ArticlePubMed