BDBM50265323 4-methyl-3-(3-methylbenzo[d]isoxazol-5-yl)-N-(3-morpholinophenyl)benzamide::CHEMBL495901
SMILES Cc1noc2ccc(cc12)-c1cc(ccc1C)C(=O)Nc1cccc(c1)N1CCOCC1
InChI Key InChIKey=CYQCFURFQXCIHR-UHFFFAOYSA-N
Data  1 KI
  Tab Delimited (TSV)   2D SDfile   Computed 3D by Vconf -m prep SDfile
Find this compound or compounds like it in BindingDB:
Activity Spreadsheet -- Enzyme Inhibition Constant Data from BindingDB
Found 1 hit for monomerid = 50265323
TargetMitogen-activated protein kinase 14(Homo sapiens (Human))
Glaxosmithkline
Curated by ChEMBL
LigandPNGBDBM50265323(4-methyl-3-(3-methylbenzo[d]isoxazol-5-yl)-N-(3-mo...)
Affinity DataKi:  380nM. Assay description: Displacement of fluorescent ATP competitive ligand from p38alpha
In DepthDetails ArticlePubMed