BDBM50265326 3-(1H-indazol-5-yl)-4-methyl-N-(3-morpholinophenyl)benzamide::CHEMBL496104
SMILES Cc1ccc(cc1-c1ccc2[nH]ncc2c1)C(=O)Nc1cccc(c1)N1CCOCC1
InChI Key InChIKey=RURJNCDVNGCBPL-UHFFFAOYSA-N
Data  1 KI
  Tab Delimited (TSV)   2D SDfile   Computed 3D by Vconf -m prep SDfile
Find this compound or compounds like it in BindingDB:
Activity Spreadsheet -- Enzyme Inhibition Constant Data from BindingDB
Found 1 hit for monomerid = 50265326
TargetMitogen-activated protein kinase 14(Homo sapiens (Human))
Glaxosmithkline
Curated by ChEMBL
LigandPNGBDBM50265326(3-(1H-indazol-5-yl)-4-methyl-N-(3-morpholinophenyl...)
Affinity DataKi:  110nM. Assay description: Displacement of fluorescent ATP competitive ligand from p38alpha
In DepthDetails ArticlePubMed