BDBM50265516 (R)-5-((R)-2-(4-(benzo[d]oxazol-2-ylamino)benzamido)-6-((E)-3-(pyridin-3-yl)acrylamido)hexanamido)-6-(1-carbamoylcyclohexylamino)-6-oxohexanoic acid::CHEMBL510020
SMILES NC(=O)C1(CCCCC1)NC(=O)[C@@H](CCCC(O)=O)NC(=O)[C@@H](CCCCNC(=O)\C=C\c1cccnc1)NC(=O)c1ccc(Nc2nc3ccccc3o2)cc1
InChI Key InChIKey=YCWAOGSQMPJZPY-YCKQIAHZSA-N
Data  1 IC50
  Tab Delimited (TSV)   2D SDfile   Computed 3D by Vconf -m prep SDfile
Find this compound or compounds like it in BindingDB:
Activity Spreadsheet -- Enzyme Inhibition Constant Data from BindingDB
Found 1 hit for monomerid = 50265516
TargetIntegrin alpha-4(Homo sapiens (Human))
University Of California Davis
Curated by ChEMBL
LigandPNGBDBM50265516((R)-5-((R)-2-(4-(benzo[d]oxazol-2-ylamino)benzamid...)
Affinity DataIC50:  1.15E+3nM. Assay description: Inhibition of human integrin alpha-4-beta-1-mediated MOLT4 cell adhesion to biotin-conjugated CS-1 peptide
In DepthDetails ArticlePubMed