BDBM50265544 CHEMBL525970::N-[1-(1-Acetyl-L-prolyl)piperidin-4-yl]-5-(phenylsulfonyl)-2-(trifluoromethyl)benzenesulfonamide
SMILES CC(=O)N1CCC[C@H]1C(=O)N1CCC(CC1)NS(=O)(=O)c1cc(ccc1C(F)(F)F)S(=O)(=O)c1ccccc1
InChI Key InChIKey=OFNCRSCSSBSRLH-QFIPXVFZSA-N
Data  1 IC50  1 EC50
  Tab Delimited (TSV)   2D SDfile   Computed 3D by Vconf -m prep SDfile
Find this compound or compounds like it in BindingDB:
Activity Spreadsheet -- Enzyme Inhibition Constant Data from BindingDB
Found 2 hits for monomerid = 50265544
TargetSecreted frizzled-related protein 1(Homo sapiens (Human))
Wyeth Research
Curated by ChEMBL
LigandPNGBDBM50265544(CHEMBL525970 | N-[1-(1-Acetyl-L-prolyl)piperidin-4...)
Affinity DataIC50:  160nM. Assay description: Binding affinity to human purified SARP2 by fluorescent polarization assay
In DepthDetails ArticlePubMed
TargetProto-oncogene Wnt-3(Homo sapiens (Human))
Wyeth Research
Curated by ChEMBL
LigandPNGBDBM50265544(CHEMBL525970 | N-[1-(1-Acetyl-L-prolyl)piperidin-4...)
Affinity DataEC50:  250nM. Assay description: Antagonist activity at human WNT3 expressed in human U2OS cells assessed as Wnt signaling after 16 to 18 hrs by luciferase reporter gene assay
In DepthDetails ArticlePubMed