BDBM50265671 CHEMBL4059680
SMILES CCOc1cc(=O)n(C)cc1-c1cc(NS(=O)(=O)CC)cnc1Oc1ccc(F)cc1F
InChI Key InChIKey=CPPJYPBEKJVVAT-UHFFFAOYSA-N
Data  1 KI  1 EC50
  Tab Delimited (TSV)   2D SDfile   Computed 3D by Vconf -m prep SDfile
Find this compound or compounds like it in BindingDB:
Activity Spreadsheet -- Enzyme Inhibition Constant Data from BindingDB
Found 2 hits for monomerid = 50265671
TargetBromodomain-containing protein 4(Homo sapiens (Human))
Abbvie
Curated by ChEMBL
LigandPNGBDBM50265671(CHEMBL4059680)
Affinity DataKi:  8.70nM. Assay description: Inhibition of human N-terminal His6-tagged BRD4 BD1-BD2 (57 to 550 residues) expressed in EScherichia coli BL21(DE3) after 1 hr by Alexa-647-conjugat...
In DepthDetails ArticlePubMed
TargetBromodomain-containing protein 4(Homo sapiens (Human))
Abbvie
Curated by ChEMBL
LigandPNGBDBM50265671(CHEMBL4059680)
Affinity DataEC50:  45nM. Assay description: Inhibition of BRD4 in human NCI-H1299 cells after 24 hrs by Bright-Glo luciferase reporter gene assay
In DepthDetails ArticlePubMed