BDBM50265692 (2S,5S,8S,11S,14S)-14-((5S,8S,11S,14S,17S,20S,26S,29S)-32-amino-17,29-bis(3-amino-3-oxopropyl)-5,8-di-sec-butyl-20-(3-guanidinopropyl)-14-isobutyl-11,26-dimethyl-4,7,10,13,16,19,22,25,28,31-decaoxo-3,6,9,12,15,18,21,24,27,30-decaazadotriacontanamido)-5-(2-amino-2-oxoethyl)-8-sec-butyl-11-(carboxymethyl)-2-(3-guanidinopropyl)-4,7,10,13-tetraoxo-3,6,9,12-tetraazahexadecane-1,16-dioic acid::CHEMBL505043
SMILES [#6]-[#6]-[#6@H](-[#6])-[#6@H](-[#7]-[#6](=O)-[#6@@H](-[#7]-[#6](=O)-[#6@H](-[#6])-[#7]-[#6](=O)-[#6@H](-[#6]-[#6](-[#6])-[#6])-[#7]-[#6](=O)-[#6@H](-[#6]-[#6]-[#6](-[#7])=O)-[#7]-[#6](=O)-[#6@H](-[#6]-[#6]-[#6]\[#7]=[#6](/[#7])-[#7])-[#7]-[#6](=O)-[#6]-[#7]-[#6](=O)-[#6@H](-[#6])-[#7]-[#6](=O)-[#6@H](-[#6]-[#6]-[#6](-[#7])=O)-[#7]-[#6](=O)-[#6]-[#7])-[#6@@H](-[#6])-[#6]-[#6])-[#6](=O)-[#7]-[#6]-[#6](=O)-[#7]-[#6@@H](-[#6]-[#6](-[#8])=O)-[#6](=O)-[#7]-[#6@@H](-[#6]-[#6](-[#8])=O)-[#6](=O)-[#7]-[#6@@H](-[#6@@H](-[#6])-[#6]-[#6])-[#6](=O)-[#7]-[#6@@H](-[#6]-[#6](-[#7])=O)-[#6](=O)-[#7]-[#6@@H](-[#6]-[#6]-[#6]\[#7]=[#6](/[#7])-[#7])-[#6](-[#8])=O
InChI Key InChIKey=FWISSODMNCVHCQ-FMSCSBGTSA-N
Data  1 EC50
  Tab Delimited (TSV)   2D SDfile   Computed 3D by Vconf -m prep SDfile
Find this compound or compounds like it in BindingDB:
Activity Spreadsheet -- Enzyme Inhibition Constant Data from BindingDB
Found 1 hit for monomerid = 50265692
TargetBcl-2-like protein 1(Homo sapiens (Human))
University Of Montpellier
Curated by ChEMBL
LigandPNGBDBM50265692((2S,5S,8S,11S,14S)-14-((5S,8S,11S,14S,17S,20S,26S,...)
Affinity DataEC50:  1.50E+4nM. Assay description: Binding affinity to recombinant Bcl-XL (unknown origin) expressed in Escherichia coli BL21 by fluorescence polarization assay
In DepthDetails ArticlePubMed