BDBM50265866 8-(1H-indol-6-yl)-2-(4-methylpiperazin-1-yl)-6-(trifluoromethyl)quinoxaline::CHEMBL516328
SMILES CN1CCN(CC1)c1cnc2cc(cc(-c3ccc4cc[nH]c4c3)c2n1)C(F)(F)F
InChI Key InChIKey=FZMQNYVDSIKAGO-UHFFFAOYSA-N
Data  2 IC50
  Tab Delimited (TSV)   2D SDfile   Computed 3D by Vconf -m prep SDfile
Find this compound or compounds like it in BindingDB:
Activity Spreadsheet -- Enzyme Inhibition Constant Data from BindingDB
Found 2 hits for monomerid = 50265866
TargetHepatocyte growth factor receptor(Homo sapiens (Human))
Sichuan University
Curated by ChEMBL
LigandPNGBDBM50265866(8-(1H-indol-6-yl)-2-(4-methylpiperazin-1-yl)-6-(tr...)
Affinity DataIC50:  2.00E+3nM. Assay description: Inhibition of human c-MET
In DepthDetails ArticlePubMed
TargetHepatocyte growth factor receptor(Homo sapiens (Human))
Sichuan University
Curated by ChEMBL
LigandPNGBDBM50265866(8-(1H-indol-6-yl)-2-(4-methylpiperazin-1-yl)-6-(tr...)
Affinity DataIC50:  2.00E+3nM. Assay description: Inhibition of human recombinant his-tagged c-Met by TR-FRET assay
In DepthDetails ArticlePubMed