BDBM50266035 CHEMBL4071903
SMILES NC(CO)(CO)CO.C[C@@H](Oc1cc2oc(=O)n(CCC(O)=O)c2cc1Cl)c1ncccn1
InChI Key InChIKey=IHGONDAMSULORB-SBSPUUFOSA-N
Data  2 IC50
  Tab Delimited (TSV)   2D SDfile   Computed 3D by Vconf -m prep SDfile
Find this compound or compounds like it in BindingDB:
Activity Spreadsheet -- Enzyme Inhibition Constant Data from BindingDB
Found 2 hits for monomerid = 50266035
TargetKynurenine 3-monooxygenase(Homo sapiens (Human))
Glaxosmithkline
Curated by ChEMBL
LigandPNGBDBM50266035(CHEMBL4071903)
Affinity DataIC50:  3.16E+3nM. Assay description: Inhibition of full length human KMO expressed in HEK293 cells using kynurenine as substrate measured after 20 hrs by LC-MS/MS analysis
In DepthDetails ArticlePubMed
TargetKynurenine 3-monooxygenase(Homo sapiens (Human))
Glaxosmithkline
Curated by ChEMBL
LigandPNGBDBM50266035(CHEMBL4071903)
Affinity DataIC50:  5nM. Assay description: Inhibition of full length human GST-tagged KMO expressed in baculovirus infected Sf9 insect cell membranes using kynurenine as substrate measured aft...
In DepthDetails ArticlePubMed