BDBM50266285 CHEMBL4086276
SMILES Cc1cc2n(C)c(=O)n(C)c2cc1N1C(=O)c2cccc3c(CCCO)ccc(C1=O)c23
InChI Key InChIKey=OFWWWKWUCDUISA-UHFFFAOYSA-N
Data  2 IC50  4 Kd  1 EC50
PDB links: 1 PDB ID matches this monomer.
  Tab Delimited (TSV)   2D SDfile   Computed 3D by Vconf -m prep SDfile
Find this compound or compounds like it in BindingDB:
Activity Spreadsheet -- Enzyme Inhibition Constant Data from BindingDB
Found 7 hits for monomerid = 50266285
TargetBromodomain-containing protein 1(Homo sapiens (Human))
H. Lee Moffitt Cancer Center And Research Institute
Curated by ChEMBL
LigandPNGBDBM50266285(CHEMBL4086276)
Affinity DataIC50:  6nM. Assay description: Inhibition of recombinant human BRD1 (E556 to A688 residues) expressed in bacterial expression system by BROMOscan assay
In DepthDetails ArticlePubMed
TargetTranscription initiation factor TFIID subunit 1(Homo sapiens (Human))
H. Lee Moffitt Cancer Center And Research Institute
Curated by ChEMBL
LigandPNGBDBM50266285(CHEMBL4086276)
Affinity DataIC50:  13nM. Assay description: Inhibition of recombinant human TAF1 (D1521 to D1656 residues) expressed in bacterial expression system by BROMOscan assay
TargetTranscription initiation factor TFIID subunit 1(Homo sapiens (Human))
H. Lee Moffitt Cancer Center And Research Institute
Curated by ChEMBL
LigandPNGBDBM50266285(CHEMBL4086276)
Affinity DataKd:  4.60E+3nM. Assay description: Binding affinity to human TAF1 BD 1 (1373 to 1499 residues) transfected in Escherichia coli BL21 (DE3) by isothermal titration calorimetric analysis
TargetTranscription initiation factor TFIID subunit 1(Homo sapiens (Human))
H. Lee Moffitt Cancer Center And Research Institute
Curated by ChEMBL
LigandPNGBDBM50266285(CHEMBL4086276)
Affinity DataEC50:  70nM. Assay description: Binding affinity to TAF1 in HEK293T cells assessed as increase in TAF1 level by ITDR analysis
TargetTranscription initiation factor TFIID subunit 1(Homo sapiens (Human))
H. Lee Moffitt Cancer Center And Research Institute
Curated by ChEMBL
LigandPNGBDBM50266285(CHEMBL4086276)
Affinity DataKd:  9.30nM. Assay description: Binding affinity to human TAF1 tandem bromodomain (1373 to 1499 residues) transfected in Escherichia coli BL21 (DE3) assessed as dissociation constan...
TargetTranscription initiation factor TFIID subunit 1(Homo sapiens (Human))
H. Lee Moffitt Cancer Center And Research Institute
Curated by ChEMBL
LigandPNGBDBM50266285(CHEMBL4086276)
Affinity DataKd:  2.10E+3nM. Assay description: Binding affinity to human TAF1 tandem bromodomain (1373 to 1499 residues) transfected in Escherichia coli BL21 (DE3) assessed as dissociation constan...
TargetTranscription initiation factor TFIID subunit 1(Homo sapiens (Human))
H. Lee Moffitt Cancer Center And Research Institute
Curated by ChEMBL
LigandPNGBDBM50266285(CHEMBL4086276)
Affinity DataKd:  47nM. Assay description: Binding affinity to human TAF1 BD 2 (1501 to 1635 residues) transfected in Escherichia coli BL21 (DE3) assessed as dissociation constant by isotherma...