BDBM50266330 8-(2,3-dichlorophenyl)-2-(4-methylpiperazin-1-yl)-6-(trifluoromethyl)quinoxaline::CHEMBL457339
SMILES CN1CCN(CC1)c1cnc2cc(cc(-c3cccc(Cl)c3Cl)c2n1)C(F)(F)F
InChI Key InChIKey=HHAVQAFNNPOLLY-UHFFFAOYSA-N
Data  2 IC50
  Tab Delimited (TSV)   2D SDfile   Computed 3D by Vconf -m prep SDfile
Find this compound or compounds like it in BindingDB:
Activity Spreadsheet -- Enzyme Inhibition Constant Data from BindingDB
Found 2 hits for monomerid = 50266330
TargetHepatocyte growth factor receptor(Homo sapiens (Human))
Sichuan University
Curated by ChEMBL
LigandPNGBDBM50266330(8-(2,3-dichlorophenyl)-2-(4-methylpiperazin-1-yl)-...)
Affinity DataIC50:  1.80E+3nM. Assay description: Inhibition of human c-MET
In DepthDetails ArticlePubMed
TargetHepatocyte growth factor receptor(Homo sapiens (Human))
Sichuan University
Curated by ChEMBL
LigandPNGBDBM50266330(8-(2,3-dichlorophenyl)-2-(4-methylpiperazin-1-yl)-...)
Affinity DataIC50:  1.80E+3nM. Assay description: Inhibition of human recombinant his-tagged c-Met by TR-FRET assay
In DepthDetails ArticlePubMed