BDBM50266594 CHEMBL476198::{2,4-Dioxo-5-[(6-nitro-4-oxo-4H-chromen-3-yl)methylene]-1,3-thiazolidine-3yl}acetic acid
SMILES OC(=O)CN1C(=O)S\C(=C\c2coc3ccc(cc3c2=O)[N+]([O-])=O)C1=O
InChI Key InChIKey=DKOMYYMPAHVEPN-QDEBKDIKSA-N
Data  1 IC50
  Tab Delimited (TSV)   2D SDfile   Computed 3D by Vconf -m prep SDfile
Find this compound or compounds like it in BindingDB:
Activity Spreadsheet -- Enzyme Inhibition Constant Data from BindingDB
Found 1 hit for monomerid = 50266594
TargetAldo-keto reductase family 1 member B1(Rattus norvegicus)
Ankara University
Curated by ChEMBL
LigandPNGBDBM50266594(CHEMBL476198 | {2,4-Dioxo-5-[(6-nitro-4-oxo-4H-chr...)
Affinity DataIC50:  261nM. Assay description: Inhibition of aldose reductase in Albino rat kidney assessed as decrease in NADPH concentration by spectrophotometrically
In DepthDetails ArticlePubMed