BDBM50266683 1-(naphthalen-2-ylsulfonyl)-1H-indole::CHEMBL477838::cid_10590848
SMILES O=S(=O)(c1ccc2ccccc2c1)n1ccc2ccccc12
InChI Key InChIKey=OQXCDXOFSOQVFD-UHFFFAOYSA-N
Data  2 IC50
  Tab Delimited (TSV)   2D SDfile   Computed 3D by Vconf -m prep SDfile
Find this compound or compounds like it in BindingDB:
Activity Spreadsheet -- Enzyme Inhibition Constant Data from BindingDB
Found 2 hits for monomerid = 50266683
TargetFructose-1,6-bisphosphatase 1(Mus musculus)
University Of Massachusetts
Curated by ChEMBL
LigandPNGBDBM50266683(1-(naphthalen-2-ylsulfonyl)-1H-indole | CHEMBL4778...)
Affinity DataIC50: >3.00E+5nM. Assay description: Inhibition of fructose-1,6-bisphosphatase in mouse liver homogenates by colorimetric phosphate assay
In DepthDetails ArticlePubMed
TargetAlkaline phosphatase, tissue-nonspecific isozyme(Homo sapiens (Human))
Burnham Center For Chemical Genomics
Curated by PubChem BioAssay
LigandPNGBDBM50266683(1-(naphthalen-2-ylsulfonyl)-1H-indole | CHEMBL4778...)
Affinity DataIC50: >1.00E+5nM. Assay description: Sanford-Burnham Center for Chemical Genomics (SBCCG) Sanford-Burnham Medical Research Institute (SBMRI, San Diego, CA) NIH Molecular Libraries Screen...
In DepthDetails PCBioAssay