BDBM50266992 CHEMBL4095237
SMILES CC[C@H](C)[C@@H]1NC(=O)[C@@H]2CCCN2C(=O)[C@@H]2CCCN2C(=O)[C@@H](NC(=O)[C@H](CO)NC(=O)[C@H](CC(C)C)NC(=O)[C@@H](NC(=O)[C@@H]2CSSC[C@H](NC1=O)C(=O)N[C@@H](CC(N)=O)C(=O)N1CCC[C@H]1C(=O)N[C@@H](CC(N)=O)C(=O)NCC(=O)N[C@@H]([C@@H](C)O)C(=O)N2)[C@@H](C)O)[C@@H](C)CC
InChI Key InChIKey=WENKWILGANDPAY-PMHOUCLDSA-N
Data  1 KI
  Tab Delimited (TSV)   2D SDfile   Computed 3D by Vconf -m prep SDfile
Find this compound or compounds like it in BindingDB:
Activity Spreadsheet -- Enzyme Inhibition Constant Data from BindingDB
Found 1 hit for monomerid = 50266992
TargetCathepsin G(Homo sapiens (Human))
The University Of Queensland
Curated by ChEMBL
LigandPNGBDBM50266992(CHEMBL4095237)
Affinity DataKi:  480nM. Assay description: Inhibition of human cathepsin G using Suc-AAPF-MCA as substrate after 30 mins
In DepthDetails ArticlePubMed