BDBM50267008 CHEMBL4078047
SMILES COc1ccccc1C(=O)Nc1cc2cc(C)c(=O)n(C)c2cc1N1CCCC1
InChI Key InChIKey=COGXRBWRVXDPDM-UHFFFAOYSA-N
Data  5 IC50
  Tab Delimited (TSV)   2D SDfile   Computed 3D by Vconf -m prep SDfile
Find this compound or compounds like it in BindingDB:
Activity Spreadsheet -- Enzyme Inhibition Constant Data from BindingDB
Found 5 hits for monomerid = 50267008
TargetBromodomain-containing protein 4(Homo sapiens (Human))
University College London
Curated by ChEMBL
LigandPNGBDBM50267008(CHEMBL4078047)
Affinity DataIC50:  4.60E+3nM. Assay description: Inhibition of human BRD4-BD1 expressed in Escherichia coli BL21 after 1 hr by BROMOscan assay
Ligand InfoPC cidPC sid
In DepthDetails ArticlePubMed
TargetBromodomain and PHD finger-containing protein 3(Homo sapiens (Human))
University College London
Curated by ChEMBL
LigandPNGBDBM50267008(CHEMBL4078047)
Affinity DataIC50:  1.20E+4nM. Assay description: Inhibition of human BRPF3 expressed in Escherichia coli BL21 after 1 hr by BROMOscan assay
Ligand InfoPC cidPC sid
In DepthDetails ArticlePubMed
TargetPeregrin(Homo sapiens (Human))
University College London
Curated by ChEMBL
LigandPNGBDBM50267008(CHEMBL4078047)
Affinity DataIC50:  220nM. Assay description: Inhibition of human BRPF1 expressed in Escherichia coli BL21 after 1 hr by BROMOscan assay
Ligand InfoPC cidPC sid
In DepthDetails ArticlePubMed
TargetBromodomain-containing protein 9(Homo sapiens (Human))
University College London
Curated by ChEMBL
LigandPNGBDBM50267008(CHEMBL4078047)
Affinity DataIC50:  420nM. Assay description: Inhibition of human BRD9 expressed in Escherichia coli BL21 after 1 hr by BROMOscan assay
Ligand InfoPC cidPC sid
In DepthDetails ArticlePubMed
TargetBromodomain-containing protein 1(Homo sapiens (Human))
University College London
Curated by ChEMBL
LigandPNGBDBM50267008(CHEMBL4078047)
Affinity DataIC50:  2.60E+3nM. Assay description: Inhibition of human BRPF2-BRD1 expressed in Escherichia coli BL21 after 1 hr by BROMOscan assay
Ligand InfoPC cidPC sid
In DepthDetails ArticlePubMed