BDBM50267337 CHEMBL4071567
SMILES COc1ccc(cc1)S(=O)(=O)Nc1ccc(Nc2ncc(Cl)c(Oc3cccc(NC(=O)C=C)c3)n2)cc1
InChI Key InChIKey=JAZDXGNHKJRAMD-UHFFFAOYSA-N
Data  1 IC50
  Tab Delimited (TSV)   2D SDfile   Computed 3D by Vconf -m prep SDfile
Find this compound or compounds like it in BindingDB:
Activity Spreadsheet -- Enzyme Inhibition Constant Data from BindingDB
Found 1 hit for monomerid = 50267337
TargetTyrosine-protein kinase BTK(Homo sapiens (Human))
Dalian Medical University
Curated by ChEMBL
LigandPNGBDBM50267337(CHEMBL4071567)
Affinity DataIC50:  0.420nM. Assay description: Inhibition of human recombinant full-length N-terminal His-tagged BTK expressed in baculovirus infected Sf9 insect cells after 60 mins by ADP-Glo kin...
In DepthDetails ArticlePubMed