BDBM50267599 (2,3-Dimethoxyphenyl)-(1-(p-fluorobenzyl)-piperidine-4-yl)-methanol::CHEMBL489618
SMILES COc1cccc(C(O)C2CCN(Cc3ccc(F)cc3)CC2)c1OC
InChI Key InChIKey=ACARRFRVNJRYJL-UHFFFAOYSA-N
Data  1 KI
  Tab Delimited (TSV)   2D SDfile   Computed 3D by Vconf -m prep SDfile
Find this compound or compounds like it in BindingDB:
Activity Spreadsheet -- Enzyme Inhibition Constant Data from BindingDB
Found 1 hit for monomerid = 50267599
Target5-hydroxytryptamine receptor 2A(Rattus norvegicus (rat))
Institute Of Nuclear Chemistry Johannes Gutenberg-University Mainz
Curated by ChEMBL
LigandPNGBDBM50267599((2,3-Dimethoxyphenyl)-(1-(p-fluorobenzyl)-piperidi...)
Affinity DataKi: >1.00E+3nM. Assay description: Displacement of [3H]MDL from rat 5HT2A receptor expressed in GF62 cells by liquid scintillation analyser
In DepthDetails ArticlePubMed