BDBM50267633 (R)-(3-Hydroxy-2-methoxyphenyl)-(1-(2-p-fluorophenylethyl)-piperidine-4-yl)-methanol::CHEMBL489621::cid_9906851
SMILES COc1c(O)cccc1[C@H](O)C1CCN(CCc2ccc(F)cc2)CC1
InChI Key InChIKey=DVDGOKMQDYFKFY-HXUWFJFHSA-N
Data  1 KI  2 EC50
  Tab Delimited (TSV)   2D SDfile   Computed 3D by Vconf -m prep SDfile
Find this compound or compounds like it in BindingDB:
Activity Spreadsheet -- Enzyme Inhibition Constant Data from BindingDB
Found 3 hits for monomerid = 50267633
Target5-hydroxytryptamine receptor 2A(Rattus norvegicus (rat))
Institute Of Nuclear Chemistry Johannes Gutenberg-University Mainz
Curated by ChEMBL
LigandPNGBDBM50267633((R)-(3-Hydroxy-2-methoxyphenyl)-(1-(2-p-fluorophen...)
Affinity DataKi:  0.25nM. Assay description: Displacement of [3H]MDL from rat 5HT2A receptor expressed in GF62 cells by liquid scintillation analyser
In DepthDetails ArticlePubMed
TargetPOsterior Segregation(Caenorhabditis elegans)
Broad Institute
Curated by PubChem BioAssay
LigandPNGBDBM50267633((R)-(3-Hydroxy-2-methoxyphenyl)-(1-(2-p-fluorophen...)
Affinity DataEC50:  1.44E+4nM. Assay description: Broad Institute: MLPCN maternal gene expression Project ID: 2024 Keywords: Zinc finger, C. elegans, maternal gene expression, RNA-protein interac...
In DepthDetails PCBioAssay
TargetZinc finger protein mex-5(Caenorhabditis elegans)
Broad Institute
Curated by PubChem BioAssay
LigandPNGBDBM50267633((R)-(3-Hydroxy-2-methoxyphenyl)-(1-(2-p-fluorophen...)
Affinity DataEC50:  1.37E+4nM. Assay description: Broad Institute: MLPCN maternal gene expression Project ID: 2024 Keywords: Zinc finger, C. elegans, maternal gene expression, RNA-protein interac...
In DepthDetails PCBioAssay