BDBM50268423 CHEMBL497202::N-(2-((1S,2R,4R)-4-(dimethylamino)-2-((4-(methylthio)phenylsulfonyl)methyl)cyclohexylamino)-2-oxoethyl)-3-(trifluoromethyl)benzamide
SMILES CSc1ccc(cc1)S(=O)(=O)C[C@@H]1C[C@@H](CC[C@@H]1NC(=O)CNC(=O)c1cccc(c1)C(F)(F)F)N(C)C
InChI Key InChIKey=ACJHGTKORBIIDI-NOXFTYBFSA-N
Data  3 IC50
  Tab Delimited (TSV)   2D SDfile   Computed 3D by Vconf -m prep SDfile
Find this compound or compounds like it in BindingDB:
Activity Spreadsheet -- Enzyme Inhibition Constant Data from BindingDB
Found 3 hits for monomerid = 50268423
TargetC-C chemokine receptor type 2(Homo sapiens (Human))
Bristol-Myers Squibb
Curated by ChEMBL
LigandPNGBDBM50268423(CHEMBL497202 | N-(2-((1S,2R,4R)-4-(dimethylamino)-...)
Affinity DataIC50:  0.370nM. Assay description: Displacement of [125I]MCP1 from CCR2 in human PBMC by millipore filter plate assay
In DepthDetails ArticlePubMed
TargetC-C chemokine receptor type 2(Homo sapiens (Human))
Bristol-Myers Squibb
Curated by ChEMBL
LigandPNGBDBM50268423(CHEMBL497202 | N-(2-((1S,2R,4R)-4-(dimethylamino)-...)
Affinity DataIC50:  2.5nM. Assay description: Antagonist activity at CCR2 in human PBMC assessed as MCP1-induced chemotaxis
In DepthDetails ArticlePubMed
TargetC-C chemokine receptor type 2(Homo sapiens (Human))
Bristol-Myers Squibb
Curated by ChEMBL
LigandPNGBDBM50268423(CHEMBL497202 | N-(2-((1S,2R,4R)-4-(dimethylamino)-...)
Affinity DataIC50:  0.300nM. Assay description: Antagonist activity at CCR2 in human PBMC assessed as MCP1-induced calcium flux by fluorescence-imaging plate reader assay
In DepthDetails ArticlePubMed