BDBM50268530 (3S,6R,9S,14aR)-3,9-dibenzyl-6-methyldecahydropyrrolo[1,2-a][1,4,7,10]tetraazacyclododecine-1,4,7,10-tetraone::CHEMBL495997
SMILES C[C@H]1NC(=O)[C@H](Cc2ccccc2)NC(=O)[C@H]2CCCN2C(=O)[C@H](Cc2ccccc2)NC1=O
InChI Key InChIKey=LTBLKAZGCWAXOX-KDXIVRHGSA-N
Data  6 KI  2 IC50
  Tab Delimited (TSV)   2D SDfile   Computed 3D by Vconf -m prep SDfile
Find this compound or compounds like it in BindingDB:
Activity Spreadsheet -- Enzyme Inhibition Constant Data from BindingDB
Found 8 hits for monomerid = 50268530
TargetMu-type opioid receptor(Rattus norvegicus (rat))
TBA
Curated by ChEMBL
LigandPNGBDBM50268530((3S,6R,9S,14aR)-3,9-dibenzyl-6-methyldecahydropyrr...)
Affinity DataKi:  775nM. Assay description: Displacement of [3H]DAMGO from rat MOP stably expressed in CHO cell membrane
In DepthDetails PubMed
TargetKappa-type opioid receptor(Homo sapiens (Human))
Adolor
Curated by ChEMBL
LigandPNGBDBM50268530((3S,6R,9S,14aR)-3,9-dibenzyl-6-methyldecahydropyrr...)
Affinity DataKi: >1.00E+3nM. Assay description: Displacement of [3H]diprenorphine from human cloned kappa opioid receptor by cell based assay
In DepthDetails ArticlePubMed
TargetMu-type opioid receptor(Homo sapiens (Human))
Adolor
Curated by ChEMBL
LigandPNGBDBM50268530((3S,6R,9S,14aR)-3,9-dibenzyl-6-methyldecahydropyrr...)
Affinity DataKi: >1.00E+3nM. Assay description: Displacement of [3H]diprenorphine from human cloned mu receptor by cell based assay
In DepthDetails ArticlePubMed
TargetDelta-type opioid receptor(Homo sapiens (Human))
Adolor
Curated by ChEMBL
LigandPNGBDBM50268530((3S,6R,9S,14aR)-3,9-dibenzyl-6-methyldecahydropyrr...)
Affinity DataKi: >1.00E+3nM. Assay description: Displacement of [3H]diprenorphine from human cloned delta receptor by cell based assay
In DepthDetails ArticlePubMed
TargetKappa-type opioid receptor(Rattus norvegicus (rat))
TBA
Curated by ChEMBL
LigandPNGBDBM50268530((3S,6R,9S,14aR)-3,9-dibenzyl-6-methyldecahydropyrr...)
Affinity DataKi:  1.72E+3nM. Assay description: Displacement of [3H]diprenorphine from rat KOP stably expressed in CHO cell membrane
In DepthDetails PubMed
TargetDelta-type opioid receptor(MOUSE)
TBA
Curated by ChEMBL
LigandPNGBDBM50268530((3S,6R,9S,14aR)-3,9-dibenzyl-6-methyldecahydropyrr...)
Affinity DataKi:  1.00E+4nM. Assay description: Displacement of [3H]DPDPE from mouse DOP stably expressed in CHO cell membrane
In DepthDetails PubMed
TargetKappa-type opioid receptor(Homo sapiens (Human))
Adolor
Curated by ChEMBL
LigandPNGBDBM50268530((3S,6R,9S,14aR)-3,9-dibenzyl-6-methyldecahydropyrr...)
Affinity DataIC50:  922nM. Assay description: Antagonist activity at human KOP stably expressed in CHO cell membrane assessed as [35S]GTPgammaS binding
In DepthDetails PubMed
TargetMu-type opioid receptor(Homo sapiens (Human))
Adolor
Curated by ChEMBL
LigandPNGBDBM50268530((3S,6R,9S,14aR)-3,9-dibenzyl-6-methyldecahydropyrr...)
Affinity DataIC50:  1.10E+3nM. Assay description: Antagonist activity at human MOP stably expressed in CHO cell membrane assessed as [35S]GTPgammaS binding
In DepthDetails PubMed