BDBM50268700 3-oxo-N-(3-phenylisoxazol-5-yl)-3H-spiro[isobenzofuran-1,4'-piperidine]-1'-carboxamide::CHEMBL495580
SMILES O=C(Nc1cc(no1)-c1ccccc1)N1CCC2(CC1)OC(=O)c1ccccc21
InChI Key InChIKey=OCGLBXLPRIRABM-UHFFFAOYSA-N
Data  1 IC50
  Tab Delimited (TSV)   2D SDfile   Computed 3D by Vconf -m prep SDfile
Find this compound or compounds like it in BindingDB:
Activity Spreadsheet -- Enzyme Inhibition Constant Data from BindingDB
Found 1 hit for monomerid = 50268700
TargetNeuropeptide Y receptor type 5(Homo sapiens (Human))
Tsukuba Research Institute
Curated by ChEMBL
LigandPNGBDBM50268700(3-oxo-N-(3-phenylisoxazol-5-yl)-3H-spiro[isobenzof...)
Affinity DataIC50:  0.840nM. Assay description: Displacement of [125I]PYY from human recombinant NPY Y5 receptor expressed in mouse LMtk- cells
In DepthDetails ArticlePubMed