BDBM50268911 CHEMBL4064559
SMILES COc1cc2nc(nc(NC3CCN(C)CC3)c2cc1OC)N(C)CC(C)C
InChI Key InChIKey=DTBKCXDRYUDIPI-UHFFFAOYSA-N
Data  2 IC50
  Tab Delimited (TSV)   2D SDfile   Computed 3D by Vconf -m prep SDfile
Find this compound or compounds like it in BindingDB:
Activity Spreadsheet -- Enzyme Inhibition Constant Data from BindingDB
Found 2 hits for monomerid = 50268911
TargetHistone-lysine N-methyltransferase EHMT2(Homo sapiens (Human))
Icahn School Of Medicine At Mount Sinai
Curated by ChEMBL
LigandPNGBDBM50268911(CHEMBL4064559)
Affinity DataIC50:  359nM. Assay description: Inhibition of human G9a catalytic domain (913 to 1193 residues) expressed in Escherichia coli BL21 (DE3) using biotinylated H3 (1 to 25 residues) as ...
In DepthDetails ArticlePubMed
TargetHistone-lysine N-methyltransferase EHMT1(Homo sapiens (Human))
Icahn School Of Medicine At Mount Sinai
Curated by ChEMBL
LigandPNGBDBM50268911(CHEMBL4064559)
Affinity DataIC50:  28nM. Assay description: Inhibition of human GLP catalytic domain (951 to 1235 residues) expressed in Escherichia coli BL21 (DE3) using biotinylated H3 (1 to 25 residues) as ...
In DepthDetails ArticlePubMed