BDBM50269164 CHEMBL4071371
SMILES CC(C)C[C@H](NC(=O)[C@H](CC(N)=O)NC(=O)[C@H](CC1CCCCC1)NC(=O)[C@H](CC1CCCCC1)NC(=O)[C@H](Cc1cnc[nH]1)NC(=O)[C@H](CCCNC(N)=N)NC(=O)c1ccccc1)C(=O)NC(C)(C)C(=O)N[C@@H]([C@@H](C)O)C(=O)N[C@@H](CCCNC(N)=N)C(=O)N[C@@H](CCC(N)=O)C(=O)N[C@@H](CCCNC(N)=N)C(=O)N[C@@H](CC1CCCCC1)C(N)=O
InChI Key InChIKey=WRGBEYNJXNFSHM-QADYPTBRSA-N
Data  1 IC50  1 EC50
  Tab Delimited (TSV)   2D SDfile   Computed 3D by Vconf -m prep SDfile
Find this compound or compounds like it in BindingDB:
Activity Spreadsheet -- Enzyme Inhibition Constant Data from BindingDB
Found 2 hits for monomerid = 50269164
TargetNeuropeptide Y receptor type 2(Homo sapiens (Human))
Takeda Pharmaceutical
Curated by ChEMBL
LigandPNGBDBM50269164(CHEMBL4071371)
Affinity DataIC50:  7.40nM. Assay description: Displacement of [125I]peptide YY from human Y2 receptor expressed in CHO cell membranes after 60 mins by TopCount scintillation counting analysis
In DepthDetails ArticlePubMed
TargetNeuropeptide Y receptor type 2(Homo sapiens (Human))
Takeda Pharmaceutical
Curated by ChEMBL
LigandPNGBDBM50269164(CHEMBL4071371)
Affinity DataEC50:  2nM. Assay description: Agonist activity at human Y2 receptor expressed in CHO cell membranes after 120 mins by [35S]GTPgammaS binding assay
In DepthDetails ArticlePubMed