BDBM50269332 CHEMBL4082647
SMILES [O-][N+](=O)c1ccc(CN2C(=O)S\C(=C/c3cn(nc3-c3ccc(Cl)cc3)-c3ccccc3)C2=O)cc1
InChI Key InChIKey=SVJHNFDWKDAVEM-UCQKPKSFSA-N
Data  1 KI  1 IC50
  Tab Delimited (TSV)   2D SDfile   Computed 3D by Vconf -m prep SDfile
Find this compound or compounds like it in BindingDB:
Activity Spreadsheet -- Enzyme Inhibition Constant Data from BindingDB
Found 2 hits for monomerid = 50269332
TargetPancreatic triacylglycerol lipase(Sus scrofa (Pig))
Birla Institute Of Technology
Curated by ChEMBL
LigandPNGBDBM50269332(CHEMBL4082647)
Affinity DataKi:  1.44E+4nM. Assay description: Binding affinity to porcine pancreatic lipase using p-nitrophenyl butyrate as substrate by dixon plot analysis
In DepthDetails ArticlePubMed
TargetPancreatic triacylglycerol lipase(Sus scrofa (Pig))
Birla Institute Of Technology
Curated by ChEMBL
LigandPNGBDBM50269332(CHEMBL4082647)
Affinity DataIC50:  4.81E+3nM. Assay description: Inhibition of porcine pancreatic lipase using p-nitrophenyl butyrate as substrate preincubated for 5 mins followed by substrate addition measured aft...
In DepthDetails ArticlePubMed