BDBM50269347 CHEMBL4075549
SMILES [O-][N+](=O)c1ccc(CN2C(=O)S\C(=C/c3cn(nc3-c3ccc(cc3)[N+]([O-])=O)-c3ccccc3)C2=O)cc1
InChI Key InChIKey=BYXVASWVBWWPQN-UCQKPKSFSA-N
Data  1 IC50
  Tab Delimited (TSV)   2D SDfile   Computed 3D by Vconf -m prep SDfile
Find this compound or compounds like it in BindingDB:
Activity Spreadsheet -- Enzyme Inhibition Constant Data from BindingDB
Found 1 hit for monomerid = 50269347
TargetPancreatic triacylglycerol lipase(Sus scrofa (Pig))
Birla Institute Of Technology
Curated by ChEMBL
LigandPNGBDBM50269347(CHEMBL4075549)
Affinity DataIC50:  8.44E+3nM. Assay description: Inhibition of porcine pancreatic lipase using p-nitrophenyl butyrate as substrate preincubated for 5 mins followed by substrate addition measured aft...
In DepthDetails ArticlePubMed