BDBM50269349 CHEMBL2238074
SMILES COc1ccc(cc1)-c1nn(cc1\C=C1/SC(=O)NC1=O)-c1ccccc1
InChI Key InChIKey=WTDXZCNEJVVFAH-BOPFTXTBSA-N
Data  1 IC50
  Tab Delimited (TSV)   2D SDfile   Computed 3D by Vconf -m prep SDfile
Find this compound or compounds like it in BindingDB:
Activity Spreadsheet -- Enzyme Inhibition Constant Data from BindingDB
Found 1 hit for monomerid = 50269349
TargetPancreatic triacylglycerol lipase(Sus scrofa (Pig))
Birla Institute Of Technology
Curated by ChEMBL
LigandPNGBDBM50269349(CHEMBL2238074)
Affinity DataIC50:  1.31E+4nM. Assay description: Inhibition of porcine pancreatic lipase using p-nitrophenyl butyrate as substrate preincubated for 5 mins followed by substrate addition measured aft...
In DepthDetails ArticlePubMed