BDBM50269440 CHEMBL4065818
SMILES COc1ccccc1N1CCN([C@H](C)C1)c1nc(cc(=O)n1C)-c1ccncn1
InChI Key InChIKey=OKGSAWIFDJHHQO-OAHLLOKOSA-N
Data  4 IC50
  Tab Delimited (TSV)   2D SDfile   Computed 3D by Vconf -m prep SDfile
Find this compound or compounds like it in BindingDB:
Activity Spreadsheet -- Enzyme Inhibition Constant Data from BindingDB
Found 4 hits for monomerid = 50269440
TargetCytochrome P450 2D6(Homo sapiens (Human))
Mitsubishi Tanabe Pharma
Curated by ChEMBL
LigandPNGBDBM50269440(CHEMBL4065818)
Affinity DataIC50:  1.00E+4nM. Assay description: Inhibition of recombinant human CYP2D6
In DepthDetails ArticlePubMed
TargetCytochrome P450 1A2(Homo sapiens (Human))
Mitsubishi Tanabe Pharma
Curated by ChEMBL
LigandPNGBDBM50269440(CHEMBL4065818)
Affinity DataIC50:  4.10E+4nM. Assay description: Inhibition of recombinant human CYP1A2
In DepthDetails ArticlePubMed
TargetCytochrome P450 3A4(Homo sapiens (Human))
Mitsubishi Tanabe Pharma
Curated by ChEMBL
LigandPNGBDBM50269440(CHEMBL4065818)
Affinity DataIC50: >5.00E+4nM. Assay description: Inhibition of recombinant human CYP3A4
In DepthDetails ArticlePubMed
TargetGlycogen synthase kinase-3 beta(Homo sapiens (Human))
Mitsubishi Tanabe Pharma
Curated by ChEMBL
LigandPNGBDBM50269440(CHEMBL4065818)
Affinity DataIC50:  0.800nM. Assay description: Inhibition of human GSK-3beta using prephosphorylated-GS1 peptide as substrate after 1 hr in presence of [gamma-32P]ATP by liquid scintillation spect...
In DepthDetails ArticlePubMed