BDBM50269542 CHEMBL4093428
SMILES CCCCNC(=O)NS(=O)(=O)c1ccc(NC(=O)CSc2nc3ccccc3c(=O)n2-c2ccc(C)cc2)cc1
InChI Key InChIKey=SIQDOIIMXLGZCK-UHFFFAOYSA-N
Data  1 IC50
  Tab Delimited (TSV)   2D SDfile   Computed 3D by Vconf -m prep SDfile
Find this compound or compounds like it in BindingDB:
Activity Spreadsheet -- Enzyme Inhibition Constant Data from BindingDB
Found 1 hit for monomerid = 50269542
TargetPeroxisome proliferator-activated receptor gamma(Homo sapiens (Human))
Al-Azhar University
Curated by ChEMBL
LigandPNGBDBM50269542(CHEMBL4093428)
Affinity DataIC50:  434nM. Assay description: Displacement of fluormone-PPARgamma green from GST-tagged PPARgamma-LBD (unknown origin) by fluorescence polarization assay
Ligand InfoPC cidPC sid
In DepthDetails ArticlePubMed