BDBM50269591 CHEMBL4075969
SMILES Cc1ccc(cc1)-c1cc(nn1-c1ccc(cc1)S(N)(=O)=O)C(=O)OCCOc1ccc2ccc(=O)oc2c1
InChI Key InChIKey=MUMVVBYPWGEYJF-UHFFFAOYSA-N
Data  3 IC50
  Tab Delimited (TSV)   2D SDfile   Computed 3D by Vconf -m prep SDfile
Find this compound or compounds like it in BindingDB:
Activity Spreadsheet -- Enzyme Inhibition Constant Data from BindingDB
Found 3 hits for monomerid = 50269591
TargetProstaglandin G/H synthase 1(Homo sapiens (Human))
Nanjing University
Curated by ChEMBL
LigandPNGBDBM50269591(CHEMBL4075969)
Affinity DataIC50: >6.00E+4nM. Assay description: Inhibition of COX1 (unknown origin) assessed as reduction in PGE2 level using arachidonic acid as substrate after 5 mins in presence of heme by ELISA
In DepthDetails ArticlePubMed
TargetProstaglandin G/H synthase 2(Homo sapiens (Human))
Nanjing University
Curated by ChEMBL
LigandPNGBDBM50269591(CHEMBL4075969)
Affinity DataIC50:  400nM. Assay description: Inhibition of COX2 (unknown origin) assessed as reduction in PGE2 level using arachidonic acid as substrate after 5 mins in presence of heme by ELISA
In DepthDetails ArticlePubMed
TargetPolyunsaturated fatty acid 5-lipoxygenase(Rattus norvegicus)
Nanjing University
Curated by ChEMBL
LigandPNGBDBM50269591(CHEMBL4075969)
Affinity DataIC50:  1.40E+3nM. Assay description: Inhibition of 5-LOX in Sprague Dawley rat Leukocytes assessed as reduction in calcium ionophore A23187-induced LTB4 production preincubated for 30 mi...
In DepthDetails ArticlePubMed