BDBM50269844 CHEMBL517216::Dysidine
SMILES C[C@@H]1[C@@H]2CCC=C(C)[C@@]2(C)CC[C@]1(C)Cc1c(O)c(O)cc(N=CCS(O)(=O)=O)c1O
InChI Key InChIKey=MTMPMGHBQBTLFK-CIVZFWGOSA-N
Data  2 IC50
  Tab Delimited (TSV)   2D SDfile   Computed 3D by Vconf -m prep SDfile
Find this compound or compounds like it in BindingDB:
Activity Spreadsheet -- Enzyme Inhibition Constant Data from BindingDB
Found 2 hits for monomerid = 50269844
TargetTyrosine-protein phosphatase non-receptor type 1(Homo sapiens (Human))
Chinese Academy Of Sciences
Curated by ChEMBL
LigandPNGBDBM50269844(CHEMBL517216 | Dysidine)
Affinity DataIC50:  6.70E+3nM. Assay description: Inhibition of human PTP1B
In DepthDetails ArticlePubMed
TargetPhospholipase A2, membrane associated(Homo sapiens (Human))
Università
Curated by ChEMBL
LigandPNGBDBM50269844(CHEMBL517216 | Dysidine)
Affinity DataIC50:  2.00E+3nM. Assay description: Inhibition of human synovial recombinant group 2 secretory phospholipase A2 by liquid scintillation counting
In DepthDetails ArticlePubMed