BDBM50270305 CHEMBL4103338
SMILES CN1CCN(Cc2ccc(NC(=O)c3n[nH]cc3Nc3ncnc4occc34)cc2)CC1
InChI Key InChIKey=OVSVIUOGHPWXNH-UHFFFAOYSA-N
Data  4 IC50
  Tab Delimited (TSV)   2D SDfile   Computed 3D by Vconf -m prep SDfile
Find this compound or compounds like it in BindingDB:
Activity Spreadsheet -- Enzyme Inhibition Constant Data from BindingDB
Found 4 hits for monomerid = 50270305
TargetCyclin-dependent kinase 6/G1/S-specific cyclin-D1(Homo sapiens (Human))
China Pharmaceutical University
Curated by ChEMBL
LigandPNGBDBM50270305(CHEMBL4103338)
Affinity DataIC50:  5.10nM. Assay description: Inhibition of human CDK6/Cyclin D1 using RB protein as substrate preincubated for 20 mins followed by [gamma-33P]-ATP addition measure after 120 mins...
In DepthDetails ArticlePubMed
TargetCyclin-A1/Cyclin-dependent kinase 2(Homo sapiens (Human))
China Pharmaceutical University
Curated by ChEMBL
LigandPNGBDBM50270305(CHEMBL4103338)
Affinity DataIC50:  17nM. Assay description: Inhibition of human CDK2/Cyclin A1 using histone H1 as substrate preincubated for 20 mins followed by [gamma-33P]-ATP addition measure after 120 mins...
In DepthDetails ArticlePubMed
TargetReceptor-type tyrosine-protein kinase FLT3(Homo sapiens (Human))
China Pharmaceutical University
Curated by ChEMBL
LigandPNGBDBM50270305(CHEMBL4103338)
Affinity DataIC50:  2.60nM. Assay description: Inhibition of human FLT3 using EAIYAAPFAKKK as substrate preincubated for 20 mins followed by [gamma-33P]-ATP addition measure after 120 mins by filt...
In DepthDetails ArticlePubMed
TargetCyclin-dependent kinase 4/G1/S-specific cyclin-D1(Homo sapiens (Human))
China Pharmaceutical University
Curated by ChEMBL
LigandPNGBDBM50270305(CHEMBL4103338)
Affinity DataIC50:  5.70nM. Assay description: Inhibition of human CDK4/Cyclin D1 using RB protein as substrate preincubated for 20 mins followed by [gamma-33P]-ATP addition measure after 120 mins...
In DepthDetails ArticlePubMed